Reaction Details
TargetPeroxisome proliferator-activated receptor alpha
LigandBDBM28679
Substrate/CompetitorBDBM28680
Meas. Tech.Radioligand Binding Assay (IC50) and Cell-Based Transcription Assay (EC50)
IC50 10000±n/a nM
Citation Shearer, BGPatel, HSBillin, ANWay, JMWinegar, DALambert, MHXu, RXLeesnitzer, LMMerrihew, RVHuet, SWillson, TM Discovery of a novel class of PPARdelta partial agonists. Bioorg Med Chem Lett18:5018-22 (2008) 
 
Peroxisome proliferator-activated receptor alpha
Name:Peroxisome proliferator-activated receptor alpha
Type:Enzyme
Mol. Mass.:52222.08
Organism:Homo sapiens (Human)
Description:Q07869
Residue:468
BDBM28679
BDBM28680
NameBDBM28679
Synonyms:5-chloro-2-({3-[(7-chloro-8-methyl-1,2,3,4-tetrahydroisoquinoline-2-)sulfonyl]benzene}amido)benzoic acid | Anthranilic acid deriv., 18
TypeSmall organic molecule
Emp. Form.C24H20Cl2N2O5S
Mol. Mass.519.397
SMILESCc1c(Cl)ccc2CCN(Cc12)S(=O)(=O)c1cccc(c1)C(=O)Nc1ccc(Cl)cc1C(O)=O