Reaction Details
TargetPeroxisome proliferator-activated receptor delta
LigandBDBM28684
Substrate/CompetitorBDBM28662
Meas. Tech.Radioligand Binding Assay (IC50) and Cell-Based Transcription Assay (EC50)
IC50 10±n/a nM
EC50 40±n/a nM
Citation Shearer, BGPatel, HSBillin, ANWay, JMWinegar, DALambert, MHXu, RXLeesnitzer, LMMerrihew, RVHuet, SWillson, TM Discovery of a novel class of PPARdelta partial agonists. Bioorg Med Chem Lett18:5018-22 (2008) 
 
Peroxisome proliferator-activated receptor delta
Name:Peroxisome proliferator-activated receptor delta
Type:Enzyme
Mol. Mass.:49910.45
Organism:Homo sapiens (Human)
Description:Q03181
Residue:441
BDBM28684
BDBM28662
NameBDBM28684
Synonyms:2-({3-[(4-methoxy-1H-indole-1-)sulfonyl]benzene}amido)-5-methylbenzoic acid | Anthranilic acid deriv., 22
TypeSmall organic molecule
Emp. Form.C24H20N2O6S
Mol. Mass.464.49
SMILESCOc1cccc2n(ccc12)S(=O)(=O)c1cccc(c1)C(=O)Nc1ccc(C)cc1C(O)=O