Reaction Details
TargetPeroxisome proliferator-activated receptor gamma
LigandBDBM28694
Substrate/Competitor[3H]rosiglitazone
Meas. Tech.Radioligand Binding Assay (IC50) and Cell-Based Transcription Assay (EC50)
IC50 3162±n/a nM
Citation Shearer, BGPatel, HSBillin, ANWay, JMWinegar, DALambert, MHXu, RXLeesnitzer, LMMerrihew, RVHuet, SWillson, TM Discovery of a novel class of PPARdelta partial agonists. Bioorg Med Chem Lett18:5018-22 (2008) 
 
Peroxisome proliferator-activated receptor gamma
Name:Peroxisome proliferator-activated receptor gamma
Type:Nuclear Receptor
Mol. Mass.:57613.46
Organism:Homo sapiens (Human)
Description:P37231
Residue:505
BDBM28694
[3H]rosiglitazone
NameBDBM28694
Synonyms:2-({3-[(5-methoxy-4-methyl-1H-indole-1-)sulfonyl]benzene}amido)-5-methylbenzoic acid | Anthranilic acid deriv., 32
TypeSmall organic molecule
Emp. Form.C25H22N2O6S
Mol. Mass.478.517
SMILESCOc1ccc2n(ccc2c1C)S(=O)(=O)c1cccc(c1)C(=O)Nc1ccc(C)cc1C(O)=O