Reaction Details
TargetNociceptin receptor
LigandBDBM29990
Substrate/CompetitorBDBM29961
Meas. Tech.In Vitro Binding Assay (IC50) and In Vitro Agonism/Antagonism Measurements (EC50/IC50)
pH7.4±n/a
Temperature310.15±n/a K
IC50 2.0±n/a nM
EC50 5.3±n/a nM
Citation Kobayashi, KUchiyama, MTakahashi, HKawamoto, HIto, SYoshizumi, TNakashima, HKato, TShimizu, AYamamoto, IAsai, MMiyazoe, HOhno, AHirayama, MOzaki, STani, TIshii, YTanaka, TMochidome, TTadano, KFukuroda, TOhta, HOkamoto, O 2-Cyclohexylcarbonylbenzimidazoles as potent, orally available and brain-penetrable opioid receptor-like 1 (ORL1) antagonists. Bioorg Med Chem Lett19:3096-9 (2009) 
 
Nociceptin receptor
Name:Nociceptin receptor
Type:G Protein-Coupled Receptor (GPCR)
Mol. Mass.:40702.87
Organism:Homo sapiens (Human)
Description:P41146
Residue:370
BDBM29990
BDBM29961
NameBDBM29990
Synonyms:2-Cyclohexylcarbonylbenzimidazole, 7b
TypeSmall organic molecule
Emp. Form.C24H35N5O3
Mol. Mass.441.5664
SMILESCCN1CCN(CC1)c1cc2[nH]c(nc2cc1C)C(=O)[C@@]1(C)CC[C@@H](CC1)NC(=O)OC