Reaction Details
TargetD-amino-acid oxidase
LigandBDBM31164
Substrate/CompetitorBDBM10852
Meas. Tech.Biacore Binding of DAAO Inhibitors
Kd 2±n/a nM
Citation Duplantier, AJBecker, SLBohanon, MJBorzilleri, KAChrunyk, BADowns, JTHu, LYEl-Kattan, AJames, LCLiu, SLu, JMaklad, NMansour, MNMente, SPiotrowski, MASakya, SMSheehan, SSteyn, SJStrick, CAWilliams, VAZhang, L Discovery, SAR, and pharmacokinetics of a novel 3-hydroxyquinolin-2(1H)-one series of potent D-amino acid oxidase (DAAO) inhibitors. J Med Chem52:3576-85 (2009) 
 
D-amino-acid oxidase
Name:D-amino-acid oxidase
Type:Homodimer
Mol. Mass.:39476.06
Organism:Homo sapiens (Human)
Description:P14920
Residue:347
BDBM31164
BDBM10852
NameBDBM31164
Synonyms:naphthyridinone analog.,18
TypeSmall organic molecule
Emp. Form.C8H6N2O2
Mol. Mass.162.1454
SMILESOc1cc2cccnc2[nH]c1=O