Reaction Details
TargetAcetylcholinesterase
LigandBDBM31895
Substrate/CompetitorBDBM8959
Meas. Tech.AChE Inhibition Assay
pH8±n/a
Temperature298.15±n/a K
IC50 7.03±0.3 nM
Citation Camps, PFormosa, XGaldeano, CMuñoz-Torrero, DRamírez, LGómez, EIsambert, NLavilla, RBadia, AClos, MVBartolini, MMancini, FAndrisano, VArce, MPRodríguez-Franco, MIHuertas, ODafni, TLuque, FJ Pyrano[3,2-c]quinoline-6-chlorotacrine hybrids as a novel family of acetylcholinesterase- and beta-amyloid-directed anti-Alzheimer compounds. J Med Chem52:5365-79 (2009) 
 
Acetylcholinesterase
Name:Acetylcholinesterase
Type:Enzyme
Mol. Mass.:67792.70
Organism:Homo sapiens (Human)
Description:P22303
Residue:614
BDBM31895
BDBM8959
NameBDBM31895
Synonyms:Pyrano[3,2-c]quinoline-6-chlorotacrine hybrid, 20.2HCl
TypeSmall organic molecule
Emp. Form.C40H42Cl2N4O2
Mol. Mass.681.693
SMILESClc1ccc(cc1)-c1nc2ccc(cc2c2OCCCc12)C(=O)NCCCCCCCCNc1c2CCCCc2nc2cc(Cl)ccc12