Reaction Details
TargetAcetylcholinesterase
LigandBDBM31904
Substrate/CompetitorBDBM8959
Meas. Tech.AChE Inhibition Assay
pH8±n/a
Temperature298.15±n/a K
IC50 32300±2200 nM
Citation Camps, PFormosa, XGaldeano, CMuñoz-Torrero, DRamírez, LGómez, EIsambert, NLavilla, RBadia, AClos, MVBartolini, MMancini, FAndrisano, VArce, MPRodríguez-Franco, MIHuertas, ODafni, TLuque, FJ Pyrano[3,2-c]quinoline-6-chlorotacrine hybrids as a novel family of acetylcholinesterase- and beta-amyloid-directed anti-Alzheimer compounds. J Med Chem52:5365-79 (2009) 
 
Acetylcholinesterase
Name:Acetylcholinesterase
Type:Enzyme
Mol. Mass.:67792.70
Organism:Homo sapiens (Human)
Description:P22303
Residue:614
BDBM31904
BDBM8959
NameBDBM31904
Synonyms:CHEMBL345124 Propidium Iodide, 2 | propidium iodide
TypeSmall organic molecule
Emp. Form.C27H34N4
Mol. Mass.414.5846
SMILESCC[N+](C)(CC)CCCn1c(-c2ccccc2)c2cc(N)ccc2c2ccc(=[NH2+])cc12