Reaction Details
TargetAcetylcholinesterase
LigandBDBM31896
Substrate/CompetitorBDBM8959
Meas. Tech.AChE Inhibition Assay
pH8±n/a
Temperature298.15±n/a K
IC50 24.0±1.6 nM
Citation Camps, PFormosa, XGaldeano, CMuñoz-Torrero, DRamírez, LGómez, EIsambert, NLavilla, RBadia, AClos, MVBartolini, MMancini, FAndrisano, VArce, MPRodríguez-Franco, MIHuertas, ODafni, TLuque, FJ Pyrano[3,2-c]quinoline-6-chlorotacrine hybrids as a novel family of acetylcholinesterase- and beta-amyloid-directed anti-Alzheimer compounds. J Med Chem52:5365-79 (2009) 
 
Acetylcholinesterase
Name:Acetylcholinesterase
Type:Enzyme
Mol. Mass.:67659.62
Organism:Bos taurus (bovine)
Description:n/a
Residue:613
BDBM31896
BDBM8959
NameBDBM31896
Synonyms:Pyrano[3,2-c]quinoline-6-chlorotacrine hybrid, 21.2HCl
TypeSmall organic molecule
Emp. Form.C41H44Cl2N4O2
Mol. Mass.695.72
SMILESClc1ccc(cc1)-c1nc2ccc(cc2c2OCCCc12)C(=O)NCCCCCCCCCNc1c2CCCCc2nc2cc(Cl)ccc12