Reaction Details
TargetAcetylcholinesterase
LigandBDBM31897
Substrate/CompetitorBDBM8959
Meas. Tech.AChE Inhibition Assay
pH8±n/a
Temperature298.15±n/a K
IC50 93.7±3.2 nM
Citation Camps, PFormosa, XGaldeano, CMuñoz-Torrero, DRamírez, LGómez, EIsambert, NLavilla, RBadia, AClos, MVBartolini, MMancini, FAndrisano, VArce, MPRodríguez-Franco, MIHuertas, ODafni, TLuque, FJ Pyrano[3,2-c]quinoline-6-chlorotacrine hybrids as a novel family of acetylcholinesterase- and beta-amyloid-directed anti-Alzheimer compounds. J Med Chem52:5365-79 (2009) 
 
Acetylcholinesterase
Name:Acetylcholinesterase
Type:Enzyme
Mol. Mass.:67659.62
Organism:Bos taurus (bovine)
Description:n/a
Residue:613
BDBM31897
BDBM8959
NameBDBM31897
Synonyms:Pyrano[3,2-c]quinoline-6-chlorotacrine hybrid, 22.2HCl
TypeSmall organic molecule
Emp. Form.C42H46Cl2N4O2
Mol. Mass.709.746
SMILESClc1ccc(cc1)-c1nc2ccc(cc2c2OCCCc12)C(=O)NCCCCCCCCCCNc1c2CCCCc2nc2cc(Cl)ccc12