Reaction Details
TargetAcetylcholinesterase
LigandBDBM31900
Substrate/CompetitorBDBM8959
Meas. Tech.AChE Inhibition Assay
pH8±n/a
Temperature298.15±n/a K
IC50 30.8±1.9 nM
Citation Camps, PFormosa, XGaldeano, CMuñoz-Torrero, DRamírez, LGómez, EIsambert, NLavilla, RBadia, AClos, MVBartolini, MMancini, FAndrisano, VArce, MPRodríguez-Franco, MIHuertas, ODafni, TLuque, FJ Pyrano[3,2-c]quinoline-6-chlorotacrine hybrids as a novel family of acetylcholinesterase- and beta-amyloid-directed anti-Alzheimer compounds. J Med Chem52:5365-79 (2009) 
 
Acetylcholinesterase
Name:Acetylcholinesterase
Type:Enzyme
Mol. Mass.:67659.62
Organism:Bos taurus (bovine)
Description:n/a
Residue:613
BDBM31900
BDBM8959
NameBDBM31900
Synonyms:Pyrano[3,2-c]quinoline-6-chlorotacrine hybrid, 25.2HCl
TypeSmall organic molecule
Emp. Form.C40H43ClN4O2
Mol. Mass.647.248
SMILESClc1ccc2c(NCCCCCCNC(=O)CCc3ccc4nc(-c5ccccc5)c5CCCOc5c4c3)c3CCCCc3nc2c1