Reaction Details
TargetAcetylcholinesterase
LigandBDBM31901
Substrate/CompetitorBDBM8959
Meas. Tech.AChE Inhibition Assay
pH8±n/a
Temperature298.15±n/a K
IC50 29.9±0.6 nM
Citation Camps, PFormosa, XGaldeano, CMuñoz-Torrero, DRamírez, LGómez, EIsambert, NLavilla, RBadia, AClos, MVBartolini, MMancini, FAndrisano, VArce, MPRodríguez-Franco, MIHuertas, ODafni, TLuque, FJ Pyrano[3,2-c]quinoline-6-chlorotacrine hybrids as a novel family of acetylcholinesterase- and beta-amyloid-directed anti-Alzheimer compounds. J Med Chem52:5365-79 (2009) 
 
Acetylcholinesterase
Name:Acetylcholinesterase
Type:Enzyme
Mol. Mass.:67659.62
Organism:Bos taurus (bovine)
Description:n/a
Residue:613
BDBM31901
BDBM8959
NameBDBM31901
Synonyms:Pyrano[3,2-c]quinoline-6-chlorotacrine hybrid, 26.2HCl
TypeSmall organic molecule
Emp. Form.C41H45ClN4O2
Mol. Mass.661.275
SMILESClc1ccc2c(NCCCCCCCNC(=O)CCc3ccc4nc(-c5ccccc5)c5CCCOc5c4c3)c3CCCCc3nc2c1