Reaction Details
TargetAcetylcholinesterase
LigandBDBM8987
Substrate/CompetitorBDBM8959
Meas. Tech.AChE Inhibition Assay
pH8±n/a
Temperature298.15±n/a K
IC50 5.73±0.4 nM
Citation Camps, PFormosa, XGaldeano, CMuñoz-Torrero, DRamírez, LGómez, EIsambert, NLavilla, RBadia, AClos, MVBartolini, MMancini, FAndrisano, VArce, MPRodríguez-Franco, MIHuertas, ODafni, TLuque, FJ Pyrano[3,2-c]quinoline-6-chlorotacrine hybrids as a novel family of acetylcholinesterase- and beta-amyloid-directed anti-Alzheimer compounds. J Med Chem52:5365-79 (2009) 
 
Acetylcholinesterase
Name:Acetylcholinesterase
Type:Enzyme
Mol. Mass.:67659.62
Organism:Bos taurus (bovine)
Description:n/a
Residue:613
BDBM8987
BDBM8959
NameBDBM8987
Synonyms:6-chloro-1,2,3,4-tetrahydroacridin-9-amine 6-chlorotacrine.HCl Tacrine Analogue 4
TypeSmall organic molecule
Emp. Form.C13H13ClN2
Mol. Mass.232.709
SMILESNc1c2CCCCc2nc2cc(Cl)ccc12