Reaction Details
TargetCholinesterase
LigandBDBM31901
Substrate/CompetitorBDBM8978
Meas. Tech.AChE Inhibition Assay
IC50 234±n/a nM
Citation Camps, PFormosa, XGaldeano, CMuñoz-Torrero, DRamírez, LGómez, EIsambert, NLavilla, RBadia, AClos, MVBartolini, MMancini, FAndrisano, VArce, MPRodríguez-Franco, MIHuertas, ODafni, TLuque, FJ Pyrano[3,2-c]quinoline-6-chlorotacrine hybrids as a novel family of acetylcholinesterase- and beta-amyloid-directed anti-Alzheimer compounds. J Med Chem52:5365-79 (2009) 
 
Cholinesterase
Name:Cholinesterase
Type:Homotetramer
Mol. Mass.:68422.27
Organism:Homo sapiens (Human)
Description:P06276
Residue:602
BDBM31901
BDBM8978
NameBDBM31901
Synonyms:Pyrano[3,2-c]quinoline-6-chlorotacrine hybrid, 26.2HCl
TypeSmall organic molecule
Emp. Form.C41H45ClN4O2
Mol. Mass.661.275
SMILESClc1ccc2c(NCCCCCCCNC(=O)CCc3ccc4nc(-c5ccccc5)c5CCCOc5c4c3)c3CCCCc3nc2c1