Reaction Details
TargetPeptidyl-prolyl cis-trans isomerase NIMA-interacting 1
LigandBDBM34013
Substrate/CompetitorBDBM34002
Meas. Tech.Pin1 Enzymatic Activity Assay
pH7.5±n/a
Temperature288.15±n/a K
Ki 32±n/a nM
Citation Guo, CHou, XDong, LDagostino, EGreasley, SFerre, RMarakovits, JJohnson, MCMatthews, DMroczkowski, BParge, HVanarsdale, TPopoff, IPiraino, JMargosiak, SThomson, JLos, GMurray, BW Structure-based design of novel human Pin1 inhibitors (I). Bioorg Med Chem Lett19:5613-6 (2009) 
 
Peptidyl-prolyl cis-trans isomerase NIMA-interacting 1
Name:Peptidyl-prolyl cis-trans isomerase NIMA-interacting 1
Type:PROTEIN
Mol. Mass.:18248.11
Organism:Homo sapiens (Human)
Description:ChEMBL_1502595
Residue:163
BDBM34013
BDBM34002
NameBDBM34013
Synonyms:3-methylphenylalanine derivative, 22a
TypeSmall organic molecule
Emp. Form.C21H22NO5P
Mol. Mass.399.3768
SMILESCc1cccc(C[C@H](COP(O)(O)=O)NC(=O)c2ccc3ccccc3c2)c1