Reaction Details
Target11-beta-hydroxysteroid dehydrogenase 1
LigandBDBM50239632
Substrate/Competitorn/a
Meas. Tech.ChEMBL_1666539 (CHEMBL4016335)
IC50 0.600000±n/a nM
Citation Ye, XYChen, SYWu, SYoon, DSWang, HHong, ZO'Connor, SPLi, JLi, JJKennedy, LJWalker, SJNayeem, ASheriff, SCamac, DMRamamurthy, VMorin, PEZebo, RTaylor, JRMorgan, NNPonticiello, RPHarrity, TApedo, AGolla, RSeethala, RWang, MHarper, TWSleczka, BGHe, BKirby, MLeahy, DKLi, JHanson, RLGuo, ZLi, YXDiMarco, JDScaringe, RMaxwell, BMoulin, FBarrish, JCGordon, DARobl, JA Discovery of Clinical Candidate 2-((2S,6S)-2-Phenyl-6-hydroxyadamantan-2-yl)-1-(3'-hydroxyazetidin-1-yl)ethanone [BMS-816336], an Orally Active Novel Selective 11?-Hydroxysteroid Dehydrogenase Type 1 Inhibitor. J Med Chem60:4932-4948 (2017) 
 
11-beta-hydroxysteroid dehydrogenase 1
Name:11-beta-hydroxysteroid dehydrogenase 1
Type:Enzyme
Mol. Mass.:32409.16
Organism:Homo sapiens (Human)
Description:P28845
Residue:292
BDBM50239632
NameBDBM50239632
Synonyms:CHEMBL4071232
TypeSmall organic molecule
Emp. Form.C22H28FNO2
Mol. Mass.357.4616
SMILESOCC1CN(C1)C(=O)CC1(C2CC3CC(C2)CC1C3)c1ccc(F)cc1