Reaction Details
TargetKetohexokinase
LigandBDBM50241209
Substrate/Competitorn/a
Meas. Tech.ChEMBL_1669644 (CHEMBL4019532)
IC50 1585±n/a nM
Citation Huard, KAhn, KAmor, PBeebe, DABorzilleri, KAChrunyk, BACoffey, SBCong, YConn, ELCulp, JSDowling, MSGorgoglione, MFGutierrez, JAKnafels, JDLachapelle, EAPandit, JParris, KDPerez, SPfefferkorn, JAPrice, DARaymer, BRoss, TTShavnya, ASmith, ACSubashi, TATesz, GJThuma, BATu, MWeaver, JDWeng, YWithka, JMXing, GMagee, TV Discovery of Fragment-Derived Small Molecules for in Vivo Inhibition of Ketohexokinase (KHK). J Med Chem60:7835-7849 (2017) 
 
Ketohexokinase
Name:Ketohexokinase
Type:Enzyme Catalytic Domain
Mol. Mass.:32521.64
Organism:Homo sapiens (Human)
Description:n/a
Residue:298
BDBM50241209
NameBDBM50241209
Synonyms:CHEMBL4101660
TypeSmall organic molecule
Emp. Form.C16H17F3N4O
Mol. Mass.338.3276
SMILESCCc1cc2nc(c(C#N)c(N3CCC(C)(O)C3)c2[nH]1)C(F)(F)F