Reaction Details
TargetAldo-keto reductase family 1 member B10
LigandBDBM50241821
Substrate/Competitorn/a
Meas. Tech.ChEMBL_1670539 (CHEMBL4020427)
IC50 7.8±n/a nM
Citation Endo, SXia, SSuyama, MMorikawa, YOguri, HHu, DAo, YTakahara, SHorino, YHayakawa, YWatanabe, YGouda, HHara, AKuwata, KToyooka, NMatsunaga, TIkari, A Synthesis of Potent and Selective Inhibitors of Aldo-Keto Reductase 1B10 and Their Efficacy against Proliferation, Metastasis, and Cisplatin Resistance of Lung Cancer Cells. J Med Chem60:8441-8455 (2017) 
 
Aldo-keto reductase family 1 member B10
Name:Aldo-keto reductase family 1 member B10
Type:Protein
Mol. Mass.:36024.67
Organism:Homo sapiens (Human)
Description:O60218. 1ZUA; 4JII; 4GQ0
Residue:316
BDBM50241821
NameBDBM50241821
Synonyms:CHEMBL4068704
TypeSmall organic molecule
Emp. Form.C19H15F2NO4
Mol. Mass.359.3235
SMILESOc1ccc2cc(C(=O)NCCCc3cc(F)cc(F)c3)c(=O)oc2c1