Reaction Details
TargetAldo-keto reductase family 1 member B10
LigandBDBM50241822
Substrate/Competitorn/a
Meas. Tech.ChEMBL_1670539 (CHEMBL4020427)
IC50 7.0±n/a nM
Citation Endo, SXia, SSuyama, MMorikawa, YOguri, HHu, DAo, YTakahara, SHorino, YHayakawa, YWatanabe, YGouda, HHara, AKuwata, KToyooka, NMatsunaga, TIkari, A Synthesis of Potent and Selective Inhibitors of Aldo-Keto Reductase 1B10 and Their Efficacy against Proliferation, Metastasis, and Cisplatin Resistance of Lung Cancer Cells. J Med Chem60:8441-8455 (2017) 
 
Aldo-keto reductase family 1 member B10
Name:Aldo-keto reductase family 1 member B10
Type:Protein
Mol. Mass.:36024.67
Organism:Homo sapiens (Human)
Description:O60218. 1ZUA; 4JII; 4GQ0
Residue:316
BDBM50241822
NameBDBM50241822
Synonyms:CHEMBL4062779
TypeSmall organic molecule
Emp. Form.C20H19NO4
Mol. Mass.337.3692
SMILESCc1ccc(CCCNC(=O)c2cc3ccc(O)cc3oc2=O)cc1