Reaction Details
TargetNAD-dependent protein deacetylase sirtuin-3, mitochondrial
LigandBDBM50228363
Substrate/Competitorn/a
Meas. Tech.ChEMBL_1671336 (CHEMBL4021365)
IC50 850±n/a nM
Citation Yang, LMa, XYuan, CHe, YLi, LFang, SXia, WHe, TQian, SXu, ZLi, GWang, Z Discovery of 2-((4,6-dimethylpyrimidin-2-yl)thio)-N-phenylacetamide derivatives as new potent and selective human sirtuin 2 inhibitors. Eur J Med Chem134:230-241 (2017) 
 
NAD-dependent protein deacetylase sirtuin-3, mitochondrial
Name:NAD-dependent protein deacetylase sirtuin-3, mitochondrial
Type:Protein
Mol. Mass.:43582.69
Organism:Homo sapiens (Human)
Description:Q9NTG7
Residue:399
BDBM50228363
NameBDBM50228363
Synonyms:CHEMBL257991 SRT-1720
TypeSmall organic molecule
Emp. Form.C25H23N7OS
Mol. Mass.469.561
SMILESO=C(Nc1ccccc1-c1cn2c(CN3CCNCC3)csc2n1)c1cnc2ccccc2n1