Reaction Details
TargetNeutrophil elastase
LigandBDBM50004185
Substrate/Competitorn/a
Meas. Tech.ChEBML_63655
pH7.5±n/a
IC50 404±n/a nM
Commentsextracted
Citation Skiles, JWMiao, CSorcek, RJacober, SMui, PWChow, GWeldon, SMPossanza, GSkoog, MKeirns, J Inhibition of human leukocyte elastase by N-substituted peptides containing alpha,alpha-difluorostatone residues at P1. J Med Chem35:4795-808 (1993) Neutrophil elastase
Name:Neutrophil elastase
Type:Enzyme
Mol. Mass.:28532.38
Organism:Homo sapiens (Human)
Description:P08246
Residue:267
BDBM50004185
NameBDBM50004185
Synonyms:4-[2-({2-[4-(4-Chloro-benzenesulfonylaminocarbonyl)-benzoylamino]-3-methyl-butyryl}-indan-2-yl-amino)-acetylamino]-2,2-difluoro-5-methyl-3-oxo-hexanoic acid ethyl ester | CHEMBL263927
TypeSmall organic molecule
Emp. Form.C39H43ClF2N4O9S
Mol. Mass.817.295
SMILESCCOC(=O)C(F)(F)C(=O)C(NC(=O)CN(C1Cc2ccccc2C1)C(=O)C(NC(=O)c1ccc(cc1)C(=O)NS(=O)(=O)c1ccc(Cl)cc1)C(C)C)C(C)C