Reaction Details
TargetNeutrophil elastase
LigandBDBM50004192
Substrate/Competitorn/a
Meas. Tech.ChEBML_63655
pH7.5±n/a
IC50 69.0±n/a nM
Commentsextracted
Citation Skiles, JWMiao, CSorcek, RJacober, SMui, PWChow, GWeldon, SMPossanza, GSkoog, MKeirns, J Inhibition of human leukocyte elastase by N-substituted peptides containing alpha,alpha-difluorostatone residues at P1. J Med Chem35:4795-808 (1993) Neutrophil elastase
Name:Neutrophil elastase
Type:Enzyme
Mol. Mass.:28532.38
Organism:Homo sapiens (Human)
Description:P08246
Residue:267
BDBM50004192
NameBDBM50004192
Synonyms:CHEMBL344981 | [2-(4-{2-[(2-Benzyloxycarbonylamino-3-methyl-butyryl)-indan-2-yl-amino]-acetylamino}-2,2-difluoro-5-methyl-3-oxo-hexanoylamino)-acetylamino]-acetic acid ethyl ester
TypeSmall organic molecule
Emp. Form.C37H47F2N5O9
Mol. Mass.743.794
SMILESCCOC(=O)CNC(=O)CNC(=O)C(F)(F)C(=O)C(NC(=O)CN(C1Cc2ccccc2C1)C(=O)C(NC(=O)OCc1ccccc1)C(C)C)C(C)C