Reaction Details
TargetCholinesterase
LigandBDBM50246979
Substrate/Competitorn/a
Meas. Tech.ChEMBL_1677307 (CHEMBL4027450)
IC50 4.9±n/a nM
Citation Ko?ak, UBrus, BKnez, D?akelj, STrontelj, JPi?lar, A?ink, RJuki?, M?ivin, MPodkowa, ANachon, FBrazzolotto, XStojan, JKos, JCoquelle, NSa?at, KColletier, JPGobec, S The Magic of Crystal Structure-Based Inhibitor Optimization: Development of a Butyrylcholinesterase Inhibitor with Picomolar Affinity and in Vivo Activity. J Med Chem61:119-139 (2018) 
 
Cholinesterase
Name:Cholinesterase
Type:Homotetramer
Mol. Mass.:68422.27
Organism:Homo sapiens (Human)
Description:P06276
Residue:602
BDBM50246979
NameBDBM50246979
Synonyms:CHEMBL4105611 | US20230331674, Table 1.1
TypeSmall organic molecule
Emp. Form.C26H32N2O3S
Mol. Mass.452.609
SMILESCOCCN(CC1CCCN(Cc2ccccc2)C1)S(=O)(=O)c1ccc2ccccc2c1