Reaction Details
TargetCholinesterase
LigandBDBM50027376
Substrate/Competitorn/a
Meas. Tech.ChEMBL_1677307 (CHEMBL4027450)
IC50 21±n/a nM
Citation Ko?ak, UBrus, BKnez, D?akelj, STrontelj, JPi?lar, A?ink, RJuki?, M?ivin, MPodkowa, ANachon, FBrazzolotto, XStojan, JKos, JCoquelle, NSa?at, KColletier, JPGobec, S The Magic of Crystal Structure-Based Inhibitor Optimization: Development of a Butyrylcholinesterase Inhibitor with Picomolar Affinity and in Vivo Activity. J Med Chem61:119-139 (2018) 
 
Cholinesterase
Name:Cholinesterase
Type:Homotetramer
Mol. Mass.:68422.27
Organism:Homo sapiens (Human)
Description:P06276
Residue:602
BDBM50027376
NameBDBM50027376
Synonyms:CHEMBL3338391
TypeSmall organic molecule
Emp. Form.C29H34N2O2
Mol. Mass.442.5925
SMILESCOCCN(CC1CCCN(C1)C1Cc2ccccc2C1)C(=O)c1ccc2ccccc2c1