Reaction Details
TargetCytochrome P450 3A4
LigandBDBM50249435
Substrate/Competitorn/a
Meas. Tech.ChEBML_1679938
IC50 340±n/a nM
Citation Melancon, BJWood, MRNoetzel, MJNance, KDEngelberg, EMHan, CLamsal, AChang, SCho, HPByers, FWBubser, MJones, CKNiswender, CMWood, MWEngers, DWWu, DBrandon, NJDuggan, MEConn, PJBridges, TMLindsley, CW Optimization of M Bioorg Med Chem Lett27:2296-2301 (2017) 
 
Cytochrome P450 3A4
Name:Cytochrome P450 3A4
Type:Enzyme
Mol. Mass.:57349.57
Organism:Homo sapiens (Human)
Description:n/a
Residue:503
BDBM50249435
NameBDBM50249435
Synonyms:CHEMBL4070692
TypeSmall organic molecule
Emp. Form.C21H19N5OS
Mol. Mass.389.473
SMILESCc1nnc2sc(C(=O)NCc3ccc(cc3)-c3ccncc3)c(N)c2c1C