Reaction Details
TargetMitogen-activated protein kinase 1
LigandBDBM50265962
Substrate/Competitorn/a
Meas. Tech.ChEMBL_1700374 (CHEMBL4051356)
IC50<0.300000±n/a nM
Citation Ward, RABethel, PCook, CDavies, EDebreczeni, JEFairley, GFeron, LFlemington, VGraham, MAGreenwood, RGriffin, NHanson, LHopcroft, PHoward, TDHudson, JJames, MJones, CDJones, CRLamont, SLewis, RLindsay, NRoberts, KSimpson, ISt-Gallay, SSwallow, STang, JTonge, MWang, ZZhai, B Structure-Guided Discovery of Potent and Selective Inhibitors of ERK1/2 from a Modestly Active and Promiscuous Chemical Start Point. J Med Chem60:3438-3450 (2017) 
 
Mitogen-activated protein kinase 1
Name:Mitogen-activated protein kinase 1
Type:Ser/Thr Protein Kinase
Mol. Mass.:41392.76
Organism:Homo sapiens (Human)
Description:P28482
Residue:360
BDBM50265962
NameBDBM50265962
Synonyms:CHEMBL4101072
TypeSmall organic molecule
Emp. Form.C23H24N8O
Mol. Mass.428.4897
SMILESCc1cccc(CN2CCn3cc(cc3C2=O)-c2nc(Nc3ccnn3C)ncc2C)n1