Reaction Details
TargetFree fatty acid receptor 1
LigandBDBM50267059
Substrate/Competitorn/a
Meas. Tech.ChEMBL_1701991 (CHEMBL4053224)
Ki 1800±n/a nM
Citation Jurica, EAWu, XWilliams, KNHernandez, ASNirschl, DSRampulla, RAMathur, AZhou, MCao, GXie, CJacob, BCai, HWang, TMurphy, BJLiu, HXu, CKunselman, LKHicks, MBSun, QSchnur, DMSitkoff, DFDierks, EAApedo, AMoore, DBFoster, KACvijic, MEPanemangalore, RFlynn, NAMaxwell, BDHong, YTian, YWilkes, JJZinker, BAWhaley, JMBarrish, JCRobl, JAEwing, WREllsworth, BA Discovery of Pyrrolidine-Containing GPR40 Agonists: Stereochemistry Effects a Change in Binding Mode. J Med Chem60:1417-1431 (2017) 
 
Free fatty acid receptor 1
Name:Free fatty acid receptor 1
Type:G Protein-Coupled Receptor (GPCR)
Mol. Mass.:31473.32
Organism:Homo sapiens (Human)
Description:O14842
Residue:300
BDBM50267059
NameBDBM50267059
Synonyms:CHEMBL4091552
TypeSmall organic molecule
Emp. Form.C19H22N2O3
Mol. Mass.326.3896
SMILESCc1ccccc1COc1ccc(cn1)N1CCC[C@H]1CC(O)=O