Reaction Details
TargetFree fatty acid receptor 1
LigandBDBM50267009
Substrate/Competitorn/a
Meas. Tech.ChEMBL_1701991 (CHEMBL4053224)
Ki 35±n/a nM
Citation Jurica, EAWu, XWilliams, KNHernandez, ASNirschl, DSRampulla, RAMathur, AZhou, MCao, GXie, CJacob, BCai, HWang, TMurphy, BJLiu, HXu, CKunselman, LKHicks, MBSun, QSchnur, DMSitkoff, DFDierks, EAApedo, AMoore, DBFoster, KACvijic, MEPanemangalore, RFlynn, NAMaxwell, BDHong, YTian, YWilkes, JJZinker, BAWhaley, JMBarrish, JCRobl, JAEwing, WREllsworth, BA Discovery of Pyrrolidine-Containing GPR40 Agonists: Stereochemistry Effects a Change in Binding Mode. J Med Chem60:1417-1431 (2017) 
 
Free fatty acid receptor 1
Name:Free fatty acid receptor 1
Type:G Protein-Coupled Receptor (GPCR)
Mol. Mass.:31473.32
Organism:Homo sapiens (Human)
Description:O14842
Residue:300
BDBM50267009
NameBDBM50267009
Synonyms:CHEMBL4089171
TypeSmall organic molecule
Emp. Form.C20H20F3NO3
Mol. Mass.379.3729
SMILESCc1ccccc1Oc1ccc(cc1)N1C[C@H](C[C@H]1CC(O)=O)C(F)(F)F