Reaction Details
TargetFree fatty acid receptor 1
LigandBDBM50267039
Substrate/Competitorn/a
Meas. Tech.ChEMBL_1701991 (CHEMBL4053224)
Ki 180±n/a nM
Citation Jurica, EAWu, XWilliams, KNHernandez, ASNirschl, DSRampulla, RAMathur, AZhou, MCao, GXie, CJacob, BCai, HWang, TMurphy, BJLiu, HXu, CKunselman, LKHicks, MBSun, QSchnur, DMSitkoff, DFDierks, EAApedo, AMoore, DBFoster, KACvijic, MEPanemangalore, RFlynn, NAMaxwell, BDHong, YTian, YWilkes, JJZinker, BAWhaley, JMBarrish, JCRobl, JAEwing, WREllsworth, BA Discovery of Pyrrolidine-Containing GPR40 Agonists: Stereochemistry Effects a Change in Binding Mode. J Med Chem60:1417-1431 (2017) 
 
Free fatty acid receptor 1
Name:Free fatty acid receptor 1
Type:G Protein-Coupled Receptor (GPCR)
Mol. Mass.:31473.32
Organism:Homo sapiens (Human)
Description:O14842
Residue:300
BDBM50267039
NameBDBM50267039
Synonyms:CHEMBL4090766
TypeSmall organic molecule
Emp. Form.C20H22FNO2
Mol. Mass.327.3926
SMILESCc1ccccc1Cc1ccc(cc1)N1C[C@@H](F)C[C@H]1CC(O)=O