Reaction Details
TargetCoagulation factor XI
LigandBDBM50269191
Substrate/Competitorn/a
Meas. Tech.ChEMBL_1705740 (CHEMBL4056973)
Ki 0.330±n/a nM
Citation Corte, JRYang, WFang, TWang, YOsuna, HLai, AEwing, WRRossi, KAMyers, JESheriff, SLou, ZZheng, JJHarper, TWBozarth, JMWu, YLuettgen, JMSeiffert, DAQuan, MLWexler, RRLam, PYS Macrocyclic inhibitors of Factor XIa: Discovery of alkyl-substituted macrocyclic amide linkers with improved potency. Bioorg Med Chem Lett27:3833-3839 (2017) 
 
Coagulation factor XI
Name:Coagulation factor XI
Type:Enzyme
Mol. Mass.:70130.58
Organism:Homo sapiens (Human)
Description:P03951
Residue:625
BDBM50269191
NameBDBM50269191
Synonyms:CHEMBL4063746
TypeSmall organic molecule
Emp. Form.C29H28ClN9O4
Mol. Mass.602.044
SMILESCOC(=O)Nc1ccc2-c3c[nH]c(n3)[C@H](C\C=C\CC(C)C(=O)Nc2c1)NC(=O)\C=C\c1cc(Cl)ccc1-n1cnnn1