Reaction Details
TargetCoagulation factor XI
LigandBDBM50230326
Substrate/Competitorn/a
Meas. Tech.ChEMBL_1705740 (CHEMBL4056973)
Ki 0.030000±n/a nM
Citation Corte, JRYang, WFang, TWang, YOsuna, HLai, AEwing, WRRossi, KAMyers, JESheriff, SLou, ZZheng, JJHarper, TWBozarth, JMWu, YLuettgen, JMSeiffert, DAQuan, MLWexler, RRLam, PYS Macrocyclic inhibitors of Factor XIa: Discovery of alkyl-substituted macrocyclic amide linkers with improved potency. Bioorg Med Chem Lett27:3833-3839 (2017) 
 
Coagulation factor XI
Name:Coagulation factor XI
Type:Enzyme
Mol. Mass.:70130.58
Organism:Homo sapiens (Human)
Description:P03951
Residue:625
BDBM50230326
NameBDBM50230326
Synonyms:CHEMBL4060950
TypeSmall organic molecule
Emp. Form.C28H25Cl2N9O4
Mol. Mass.622.462
SMILESCOC(=O)Nc1ccc2-c3nc([nH]c3Cl)[C@H](C\C=C\CCC(=O)Nc2c1)NC(=O)\C=C\c1cc(Cl)ccc1-n1cnnn1