Reaction Details
TargetCREB-binding protein
LigandBDBM50200445
Substrate/Competitorn/a
Meas. Tech.ChEMBL_1707370 (CHEMBL4058603)
IC50 410±n/a nM
Citation Romero, FAMurray, JLai, KWTsui, VAlbrecht, BKAn, LBeresini, MHde Leon Boenig, GBronner, SMChan, EWChen, KXChen, ZChoo, EFClagg, KClark, KCrawford, TDCyr, Pde Almeida Nagata, DGascoigne, KEGrogan, JLHatzivassiliou, GHuang, WHunsaker, TLKaufman, SKoenig, SGLi, RLi, YLiang, XLiao, JLiu, WLy, JMaher, JMasui, CMerchant, MRan, YTaylor, AMWai, JWang, FWei, XYu, DZhu, BYZhu, XMagnuson, S GNE-781, A Highly Advanced Potent and Selective Bromodomain Inhibitor of Cyclic Adenosine Monophosphate Response Element Binding Protein, Binding Protein (CBP). J Med Chem60:9162-9183 (2017) 
 
CREB-binding protein
Name:CREB-binding protein
Type:Transcription Coactivator
Mol. Mass.:265411.66
Organism:Homo sapiens (Human)
Description:Q92793
Residue:2442
BDBM50200445
NameBDBM50200445
Synonyms:CHEMBL3897393 | US9763922, Example 300
TypeSmall organic molecule
Emp. Form.C22H25FN6O2
Mol. Mass.424.4713
SMILESCC(=O)N1CCc2c(C1)c(Nc1ccc(cc1F)-c1cnn(C)c1)nn2[C@H]1CCOC1