Reaction Details
TargetBifunctional purine biosynthesis protein ATIC
LigandBDBM50014843
Substrate/Competitorn/a
Meas. Tech.ChEMBL_28427 (CHEMBL642470)
IC50 574000±n/a nM
Citation Kelley, JLMcLean, EWCohn, NKEdelstein, MPDuch, DSSmith, GKHanlon, MHFerone, R Synthesis and biological activity of an acyclic analogue of 5,6,7,8-tetrahydrofolic acid, N-[4-[[3-(2,4-diamino-1,6-dihydro-6-oxo-5- pyrimidinyl)propyl]amino]-benzoyl]-L-glutamic acid. J Med Chem33:561-7 (1990) Bifunctional purine biosynthesis protein ATIC
Name:Bifunctional purine biosynthesis protein ATIC
Type:PROTEIN
Mol. Mass.:64218.64
Organism:Mus musculus
Description:ChEMBL_28425
Residue:592
BDBM50014843
NameBDBM50014843
Synonyms:2-(4-{[3-(2,4-Diamino-6-oxo-1,6-dihydro-pyrimidin-5-yl)-propyl]-formyl-amino}-benzoylamino)-pentanedioic acid | CHEMBL152172
TypeSmall organic molecule
Emp. Form.C20H24N6O7
Mol. Mass.460.4406
SMILESNc1nc(N)c(CCCN(C=O)c2ccc(cc2)C(=O)NC(CCC(O)=O)C(O)=O)c(=O)[nH]1