Reaction Details
TargetSerine protease 1
LigandBDBM50071571
Substrate/Competitorn/a
Meas. Tech.ChEBML_213071
Ki 0.430000±n/a nM
Citation Ogbu, COQabar, MNBoatman, PDUrban, JMeara, JPFerguson, MDTulinsky, JLum, CBabu, SBlaskovich, MANakanishi, HRuan, FCao, BMinarik, RLittle, TNelson, SNguyen, MGall, AKahn, M Highly efficient and versatile synthesis of libraries of constrained beta-strand mimetics. Bioorg Med Chem Lett8:2321-6 (1999) Serine protease 1
Name:Serine protease 1
Type:Enzyme
Mol. Mass.:26557.80
Organism:Homo sapiens (Human)
Description:P07477
Residue:247
BDBM50071571
NameBDBM50071571
Synonyms:8-Isobutyl-2-(3-methyl-butyl)-1,3-dioxo-2,3,5,8-tetrahydro-1H-[1,2,4]triazolo[1,2-a]pyridazine-5-carboxylic acid {5-amino-1-[2-(4-carbamoyl-phenyl)-ethylaminooxalyl]-pentyl}-amide | CHEMBL75269
TypeSmall organic molecule
Emp. Form.C32H47N7O6
Mol. Mass.625.7589
SMILESCC(C)CCn1c(=O)n2C(CC(C)C)C=CC(C(=O)NC(CCCCN)C(=O)C(=O)NCCc3ccc(cc3)C(N)=O)n2c1=O