Reaction Details
TargetProthrombin
LigandBDBM50071574
Substrate/Competitorn/a
Meas. Tech.ChEBML_208893
Ki 5.1±n/a nM
Citation Ogbu, COQabar, MNBoatman, PDUrban, JMeara, JPFerguson, MDTulinsky, JLum, CBabu, SBlaskovich, MANakanishi, HRuan, FCao, BMinarik, RLittle, TNelson, SNguyen, MGall, AKahn, M Highly efficient and versatile synthesis of libraries of constrained beta-strand mimetics. Bioorg Med Chem Lett8:2321-6 (1999) Prothrombin
Name:Prothrombin
Type:Protein
Mol. Mass.:70029.57
Organism:Homo sapiens (Human)
Description:P00734
Residue:622
BDBM50071574
NameBDBM50071574
Synonyms:2,2-Diisobutyl-7-methyl-1,3-dioxo-2,3,5,8-tetrahydro-1H-pyrazolo[1,2-a]pyridazine-5-carboxylic acid {5-amino-1-[2-(4-carbamoyl-phenyl)-ethylaminooxalyl]-pentyl}-amide | CHEMBL309360
TypeSmall organic molecule
Emp. Form.C33H48N6O6
Mol. Mass.624.7708
SMILESCC(C)CC1(CC(C)C)C(=O)N2CC(C)=CC(N2C1=O)C(=O)NC(CCCCN)C(=O)C(=O)NCCc1ccc(cc1)C(N)=O