Reaction Details
TargetRenin
LigandBDBM50077678
Substrate/Competitorn/a
Meas. Tech.ChEMBL_195757 (CHEMBL803424)
IC50 0.087000±n/a nM
Citation Güller, RBinggeli, ABreu, VBur, DFischli, WHirth, GJenny, CKansy, MMontavon, FMüller, MOefner, CStadler, HVieira, EWilhelm, MWostl, WMärki, HP Piperidine-renin inhibitors compounds with improved physicochemical properties. Bioorg Med Chem Lett9:1403-8 (1999) Renin
Name:Renin
Type:Enzyme
Mol. Mass.:45058.99
Organism:Homo sapiens (Human)
Description:n/a
Residue:406
BDBM50077678
NameBDBM50077678
Synonyms:(3R,4R)-3-(1,4-Dimethoxy-naphthalen-2-ylmethoxy)-4-{4-[3-(2-methoxy-benzyloxy)-propoxy]-phenyl}-piperidine | CHEMBL430539
TypeSmall organic molecule
Emp. Form.C35H41NO6
Mol. Mass.571.7031
SMILESCOc1ccccc1COCCCOc1ccc(cc1)[C@H]1CCNC[C@@H]1OCc1cc(OC)c2ccccc2c1OC