Reaction Details
TargetProstaglandin G/H synthase 2
LigandBDBM50080087
Substrate/Competitorn/a
Meas. Tech.ChEMBL_159909 (CHEMBL768958)
IC50 40±n/a nM
Citation Leblanc, YRoy, PBoyce, SBrideau, CChan, CCCharleson, SGordon, RGrimm, EGuay, JLéger, SLi, CSRiendeau, DVisco, DWang, ZWebb, JXu, LJPrasit, P SAR in the alkoxy lactone series: the discovery of DFP, a potent and orally active COX-2 inhibitor. Bioorg Med Chem Lett9:2207-12 (1999) Prostaglandin G/H synthase 2
Name:Prostaglandin G/H synthase 2
Type:Enzyme
Mol. Mass.:69003.89
Organism:Homo sapiens (Human)
Description:Recombinant Cox-2 provided by Cayman (Cayman Chemical Co.,Ann Arbor, MI).
Residue:604
BDBM50080087
NameBDBM50080087
Synonyms:3-sec-Butoxy-4-(4-methanesulfonyl-phenyl)-5,5-dimethyl-5H-furan-2-one | CHEMBL304982
TypeSmall organic molecule
Emp. Form.C17H22O5S
Mol. Mass.338.419
SMILESCCC(C)OC1=C(c2ccc(cc2)S(C)(=O)=O)C(C)(C)OC1=O