Reaction Details
TargetCytochrome P450 3A4
LigandBDBM155921
Substrate/Competitorn/a
Meas. Tech.ChEMBL_1924569 (CHEMBL4427525)
IC50>50000±n/a nM
Citation Tang, HZhu, YTeumelsan, NWalsh, SPShahripour, APriest, BTSwensen, AMFelix, JPBrochu, RMBailey, TThomas-Fowlkes, BPai, LYHampton, CCorona, AHernandez, MMetzger, JForrest, MZhou, XOwens, KTong, VParmee, ERoy, SKaczorowski, GJYang, LAlonso-Galicia, MGarcia, MLPasternak, A Discovery of MK-7145, an Oral Small Molecule ROMK Inhibitor for the Treatment of Hypertension and Heart Failure. ACS Med Chem Lett7:697-701 (2016) 
 
Cytochrome P450 3A4
Name:Cytochrome P450 3A4
Type:Enzyme
Mol. Mass.:57349.57
Organism:Homo sapiens (Human)
Description:n/a
Residue:503
BDBM155921
NameBDBM155921
Synonyms:US9018211, 2A
TypeSmall organic molecule
Emp. Form.C26H30N2O6
Mol. Mass.466.5262
SMILESCc1c2COC(=O)c2ccc1[C@@H](O)CN1CCN(C[C@H](O)c2ccc3C(=O)OCc3c2C)CC1