Reaction Details
TargetSodium channel protein type 5 subunit alpha
LigandBDBM155921
Substrate/Competitorn/a
Meas. Tech.ChEMBL_1924568 (CHEMBL4427524)
IC50>30000±n/a nM
Citation Tang, HZhu, YTeumelsan, NWalsh, SPShahripour, APriest, BTSwensen, AMFelix, JPBrochu, RMBailey, TThomas-Fowlkes, BPai, LYHampton, CCorona, AHernandez, MMetzger, JForrest, MZhou, XOwens, KTong, VParmee, ERoy, SKaczorowski, GJYang, LAlonso-Galicia, MGarcia, MLPasternak, A Discovery of MK-7145, an Oral Small Molecule ROMK Inhibitor for the Treatment of Hypertension and Heart Failure. ACS Med Chem Lett7:697-701 (2016) 
 
Sodium channel protein type 5 subunit alpha
Name:Sodium channel protein type 5 subunit alpha
Type:Enzyme
Mol. Mass.:226908.60
Organism:Homo sapiens (Human)
Description:Q14524
Residue:2016
BDBM155921
NameBDBM155921
Synonyms:US9018211, 2A
TypeSmall organic molecule
Emp. Form.C26H30N2O6
Mol. Mass.466.5262
SMILESCc1c2COC(=O)c2ccc1[C@@H](O)CN1CCN(C[C@H](O)c2ccc3C(=O)OCc3c2C)CC1