Reaction Details
TargetAcetylcholinesterase
LigandBDBM155921
Substrate/Competitorn/a
Meas. Tech.ChEMBL_1924573 (CHEMBL4427529)
IC50 9940±n/a nM
Citation Tang, HZhu, YTeumelsan, NWalsh, SPShahripour, APriest, BTSwensen, AMFelix, JPBrochu, RMBailey, TThomas-Fowlkes, BPai, LYHampton, CCorona, AHernandez, MMetzger, JForrest, MZhou, XOwens, KTong, VParmee, ERoy, SKaczorowski, GJYang, LAlonso-Galicia, MGarcia, MLPasternak, A Discovery of MK-7145, an Oral Small Molecule ROMK Inhibitor for the Treatment of Hypertension and Heart Failure. ACS Med Chem Lett7:697-701 (2016) 
 
Acetylcholinesterase
Name:Acetylcholinesterase
Type:Enzyme
Mol. Mass.:67792.70
Organism:Homo sapiens (Human)
Description:P22303
Residue:614
BDBM155921
NameBDBM155921
Synonyms:US9018211, 2A
TypeSmall organic molecule
Emp. Form.C26H30N2O6
Mol. Mass.466.5262
SMILESCc1c2COC(=O)c2ccc1[C@@H](O)CN1CCN(C[C@H](O)c2ccc3C(=O)OCc3c2C)CC1