Reaction Details
TargetCoagulation factor XI
LigandBDBM50541586
Substrate/Competitorn/a
Meas. Tech.ChEMBL_1984859 (CHEMBL4618265)
Ki 0.260000±n/a nM
Citation Yang, WWang, YLai, AClark, CGCorte, JRFang, TGilligan, PJJeon, YPabbisetty, KBRampulla, RAMathur, AKaspady, MNeithnadka, PRArumugam, ARaju, SRossi, KAMyers, JESheriff, SLou, ZZheng, JJChacko, SABozarth, JMWu, YCrain, EJWong, PCSeiffert, DALuettgen, JMLam, PYSWexler, RREwing, WR Discovery of a High Affinity, Orally Bioavailable Macrocyclic FXIa Inhibitor with Antithrombotic Activity in Preclinical Species. J Med Chem63:7226-7242 (2020) 
 
Coagulation factor XI
Name:Coagulation factor XI
Type:Enzyme
Mol. Mass.:70130.58
Organism:Homo sapiens (Human)
Description:P03951
Residue:625
BDBM50541586
NameBDBM50541586
Synonyms:CHEMBL4638245
TypeSmall organic molecule
Emp. Form.C31H29ClF2N4O4
Mol. Mass.595.036
SMILESCOC(=O)Nc1ccc-2c(NC(=O)[C@H](C)CCC[C@H](N3CCC(=CC3=O)c3c(F)ccc(Cl)c3F)c3cc-2ccn3)c1