Reaction Details
TargetMicrosomal triglyceride transfer protein large subunit
LigandBDBM50098321
Substrate/Competitorn/a
Meas. Tech.ChEMBL_103133 (CHEMBL712303)
IC50 0.03±n/a nM
Citation Robl, JASulsky, RSun, CQSimpkins, LMWang, TDickson, JKChen, YMagnin, DRTaunk, PSlusarchyk, WABiller, SALan, SJConnolly, FKunselman, LKSabrah, TJamil, HGordon, DHarrity, TWWetterau, JR A novel series of highly potent benzimidazole-based microsomal triglyceride transfer protein inhibitors. J Med Chem44:851-6 (2001) Microsomal triglyceride transfer protein large subunit
Name:Microsomal triglyceride transfer protein large subunit
Type:PROTEIN
Mol. Mass.:99365.65
Organism:Homo sapiens (Human)
Description:ChEMBL_971724
Residue:894
BDBM50098321
NameBDBM50098321
Synonyms:9-(4-{2,5-Dimethyl-4-[(4'-trifluoromethyl-biphenyl-2-carbonyl)-amino]-benzoimidazol-1-yl}-butyl)-9H-fluorene-9-carboxylic acid (2,2,2-trifluoro-ethyl)-amide | CHEMBL355007
TypeSmall organic molecule
Emp. Form.C43H36F6N4O2
Mol. Mass.754.762
SMILESCc1nc2c(NC(=O)c3ccccc3-c3ccc(cc3)C(F)(F)F)c(C)ccc2n1CCCCC1(C(=O)NCC(F)(F)F)c2ccccc2-c2ccccc12