Reaction Details
TargetCathepsin K
LigandBDBM50098586
Substrate/Competitorn/a
Meas. Tech.ChEMBL_216705 (CHEMBL820317)
Ki 670±n/a nM
Citation Marquis, RWRu, YLoCastro, SMZeng, JYamashita, DSOh, HJErhard, KFDavis, LDTomaszek, TATew, DSalyers, KProksch, JWard, KSmith, BLevy, MCummings, MDHaltiwanger, RCTrescher, GWang, BHemling, MEQuinn, CJCheng, HYLin, FSmith, WWJanson, CAZhao, BMcQueney, MSD'Alessio, KLee, CPMarzulli, ADodds, RABlake, SHwang, SMJames, IEGress, CJBradley, BRLark, MWGowen, MVeber, DF Azepanone-based inhibitors of human and rat cathepsin K. J Med Chem44:1380-95 (2001) Cathepsin K
Name:Cathepsin K
Type:Enzyme
Mol. Mass.:36975.68
Organism:Homo sapiens (Human)
Description:P43235
Residue:329
BDBM50098586
NameBDBM50098586
Synonyms:Benzofuran-2-carboxylic acid (3-methyl-1-{1-methyl-3-[methyl-(pyridine-2-sulfonyl)-amino]-2-oxo-propylcarbamoyl}-butyl)-amide | CHEMBL416579
TypeSmall organic molecule
Emp. Form.C25H30N4O6S
Mol. Mass.514.594
SMILESCC(C)C[C@H](NC(=O)c1cc2ccccc2o1)C(=O)N[C@@H](C)C(=O)CN(C)S(=O)(=O)c1ccccn1