Reaction Details
TargetCoagulation factor X
LigandBDBM50101869
Substrate/Competitorn/a
Meas. Tech.ChEBML_48813
Ki 10±n/a nM
Citation Rai, RKolesnikov, ALi, YYoung, WBLeahy, ESprengeler, PAVerner, EShrader, WDBurgess-Henry, JSangalang, JCAllen, DChen, XKatz, BALuong, CElrod, KCregar, L Development of potent and selective factor Xa inhibitors. Bioorg Med Chem Lett11:1797-800 (2001) Coagulation factor X
Name:Coagulation factor X
Type:Enzyme
Mol. Mass.:54726.60
Organism:Homo sapiens (Human)
Description:n/a
Residue:488
BDBM50101869
NameBDBM50101869
Synonyms:2-[3-(3-Benzyl-5-carbamimidoyl-1H-indol-2-yl)-5-bromo-4-hydroxy-phenyl]-2-methyl-propionic acid | CHEMBL51338
TypeSmall organic molecule
Emp. Form.C26H24BrN3O3
Mol. Mass.506.391
SMILESCC(C)(C(O)=O)c1cc(Br)c(O)c(c1)-c1[nH]c2ccc(cc2c1Cc1ccccc1)C(N)=N