Reaction Details
TargetTissue-type plasminogen activator
LigandBDBM50102767
Substrate/Competitorn/a
Meas. Tech.ChEMBL_225383 (CHEMBL847817)
Ki 380±n/a nM
Citation Verner, EKatz, BASpencer, JRAllen, DHataye, JHruzewicz, WHui, HCKolesnikov, ALi, YLuong, CMartelli, ARadika, KRai, RShe, MShrader, WSprengeler, PATrapp, SWang, JYoung, WBMackman, RL Development of serine protease inhibitors displaying a multicentered short (<2.3 A) hydrogen bond binding mode: inhibitors of urokinase-type plasminogen activator and factor Xa. J Med Chem44:2753-71 (2001) Tissue-type plasminogen activator
Name:Tissue-type plasminogen activator
Type:Enzyme
Mol. Mass.:62931.08
Organism:Homo sapiens (Human)
Description:n/a
Residue:562
BDBM50102767
NameBDBM50102767
Synonyms:2-(3-Bromo-2-hydroxy-phenyl)-1H-indole-5-carboxamidine | CHEMBL328772
TypeSmall organic molecule
Emp. Form.C15H12BrN3O
Mol. Mass.330.179
SMILESNC(=N)c1ccc2[nH]c(cc2c1)-c1cccc(Br)c1O