Reaction Details
TargetTissue-type plasminogen activator
LigandBDBM50102790
Substrate/Competitorn/a
Meas. Tech.ChEMBL_225382 (CHEMBL847816)
Ki 19±n/a nM
Citation Verner, EKatz, BASpencer, JRAllen, DHataye, JHruzewicz, WHui, HCKolesnikov, ALi, YLuong, CMartelli, ARadika, KRai, RShe, MShrader, WSprengeler, PATrapp, SWang, JYoung, WBMackman, RL Development of serine protease inhibitors displaying a multicentered short (<2.3 A) hydrogen bond binding mode: inhibitors of urokinase-type plasminogen activator and factor Xa. J Med Chem44:2753-71 (2001) Tissue-type plasminogen activator
Name:Tissue-type plasminogen activator
Type:Enzyme
Mol. Mass.:62931.08
Organism:Homo sapiens (Human)
Description:n/a
Residue:562
BDBM50102790
NameBDBM50102790
Synonyms:2-(2-Hydroxy-5-nitro-biphenyl-3-yl)-1H-indole-5-carboxamidine | CHEMBL94775
TypeSmall organic molecule
Emp. Form.C21H16N4O3
Mol. Mass.372.3767
SMILESNC(=N)c1ccc2[nH]c(cc2c1)-c1cc(cc(c1O)-c1ccccc1)[N+]([O-])=O