Reaction Details
TargetTissue-type plasminogen activator
LigandBDBM50101873
Substrate/Competitorn/a
Meas. Tech.ChEMBL_225382 (CHEMBL847816)
Ki 460±n/a nM
Citation Verner, EKatz, BASpencer, JRAllen, DHataye, JHruzewicz, WHui, HCKolesnikov, ALi, YLuong, CMartelli, ARadika, KRai, RShe, MShrader, WSprengeler, PATrapp, SWang, JYoung, WBMackman, RL Development of serine protease inhibitors displaying a multicentered short (<2.3 A) hydrogen bond binding mode: inhibitors of urokinase-type plasminogen activator and factor Xa. J Med Chem44:2753-71 (2001) Tissue-type plasminogen activator
Name:Tissue-type plasminogen activator
Type:Enzyme
Mol. Mass.:62931.08
Organism:Homo sapiens (Human)
Description:n/a
Residue:562
BDBM50101873
NameBDBM50101873
Synonyms:2-(3-Bromo-2-hydroxy-5-methyl-phenyl)-1H-indole-5-carboxamidine CHEMBL48608
TypeSmall organic molecule
Emp. Form.C16H14BrN3O
Mol. Mass.344.206
SMILESCc1cc(Br)c(O)c(c1)-c1cc2cc(ccc2[nH]1)C(N)=N