Reaction Details
TargetSodium channel protein type 2 subunit alpha
LigandBDBM50107029
Substrate/Competitorn/a
Meas. Tech.ChEBML_223230
IC50 760±n/a nM
Citation Padmanabhan, SLavin, RCThakker, PMGuo, JZhang, LMoore, DPerlman, MEKirk, CDaly, DBurke-Howie, KJWolcott, TChari, SBerlove, DFischer, JBHolt, WFDurant, GJMcBurney, RN Solution-phase, parallel synthesis and pharmacological evaluation of acylguanidine derivatives as potential sodium channel blockers. Bioorg Med Chem Lett11:3151-5 (2001) Sodium channel protein type 2 subunit alpha
Name:Sodium channel protein type 2 subunit alpha
Type:Enzyme
Mol. Mass.:227954.68
Organism:Homo sapiens (Human)
Description:Q99250
Residue:2005
BDBM50107029
NameBDBM50107029
Synonyms:CHEMBL108727 | N-(4-Ethoxy-benzoyl)-N'-(4-phenyl-butyl)-guanidine
TypeSmall organic molecule
Emp. Form.C20H25N3O2
Mol. Mass.339.4314
SMILESCCOc1ccc(cc1)C(=O)NC(N)=NCCCCc1ccccc1