Reaction Details
TargetcGMP-specific 3',5'-cyclic phosphodiesterase
LigandBDBM50117722
Substrate/Competitorn/a
Meas. Tech.ChEBML_155212
IC50 16±n/a nM
Citation Arnold, RBeer, DBhalay, GBaettig, UCollingwood, SPCraig, SDevereux, NDunstan, AGlen, AGomez, SHaberthuer, SHowe, TJelfs, SMoser, HNaef, RNicklin, PSandham, DStringer, RTurner, KWatson, SZurini, M 8-Aryl xanthines potent inhibitors of phosphodiesterase 5. Bioorg Med Chem Lett12:2587-90 (2002) cGMP-specific 3',5'-cyclic phosphodiesterase
Name:cGMP-specific 3',5'-cyclic phosphodiesterase
Type:Protein
Mol. Mass.:99975.83
Organism:Homo sapiens (Human)
Description:O76074
Residue:875
BDBM50117722
NameBDBM50117722
Synonyms:CHEMBL89239 | N-(2-Dimethylamino-ethyl)-3-(3-isobutyl-1-methyl-2,6-dioxo-2,3,6,7-tetrahydro-1H-purin-8-yl)-N-methyl-4-propoxy-benzenesulfonamide
TypeSmall organic molecule
Emp. Form.C24H36N6O5S
Mol. Mass.520.645
SMILESCCCOc1ccc(cc1-c1nc2n(CC(C)C)c(=O)n(C)c(=O)c2[nH]1)S(=O)(=O)N(C)CCN(C)C