Reaction Details
TargetcGMP-specific 3',5'-cyclic phosphodiesterase
LigandBDBM50117731
Substrate/Competitorn/a
Meas. Tech.ChEBML_155212
IC50 60±n/a nM
Citation Arnold, RBeer, DBhalay, GBaettig, UCollingwood, SPCraig, SDevereux, NDunstan, AGlen, AGomez, SHaberthuer, SHowe, TJelfs, SMoser, HNaef, RNicklin, PSandham, DStringer, RTurner, KWatson, SZurini, M 8-Aryl xanthines potent inhibitors of phosphodiesterase 5. Bioorg Med Chem Lett12:2587-90 (2002) cGMP-specific 3',5'-cyclic phosphodiesterase
Name:cGMP-specific 3',5'-cyclic phosphodiesterase
Type:Protein
Mol. Mass.:99975.83
Organism:Homo sapiens (Human)
Description:O76074
Residue:875
BDBM50117731
NameBDBM50117731
Synonyms:3-Isobutyl-1-methyl-8-(2-propoxy-phenyl)-3,7-dihydro-purine-2,6-dione | CHEMBL87901
TypeSmall organic molecule
Emp. Form.C19H24N4O3
Mol. Mass.356.4189
SMILESCCCOc1ccccc1-c1nc2n(CC(C)C)c(=O)n(C)c(=O)c2[nH]1