Reaction Details
TargetC-C chemokine receptor type 5
LigandBDBM50119336
Substrate/Competitorn/a
Meas. Tech.ChEMBL_39511 (CHEMBL654808)
IC50 0.1±n/a nM
Citation Lynch, CLHale, JJBudhu, RJGentry, ALMills, SGChapman, KTMacCoss, MMalkowitz, LSpringer, MSGould, SLDeMartino, JASiciliano, SJCascieri, MACarella, ACarver, GHolmes, KSchleif, WADanzeisen, RHazuda, DKessler, JLineberger, JMiller, MEmini, EA 1,3,4-Trisubstituted pyrrolidine CCR5 receptor antagonists. Part 4: synthesis of N-1 acidic functionality affording analogues with enhanced antiviral activity against HIV. Bioorg Med Chem Lett12:3001-4 (2002) C-C chemokine receptor type 5
Name:C-C chemokine receptor type 5
Type:Enzyme
Mol. Mass.:40540.21
Organism:Homo sapiens (Human)
Description:P51681
Residue:352
BDBM50119336
NameBDBM50119336
Synonyms:2-cyclohexyl-2-{3-phenyl-4-[4-(3-phenylpropyl)hexahydro-1-pyridinylmethyl]tetrahydro-1H-1-pyrrolyl}acetic acid Cyclohexyl-{3-phenyl-4-[4-(3-phenyl-propyl)-piperidin-1-ylmethyl]-pyrrolidin-1-yl}-acetic acid
TypeSmall organic molecule
Emp. Form.C33H46N2O2
Mol. Mass.502.7305
SMILESOC(=O)[C@@H](C1CCCCC1)N1C[C@H](CN2CCC(CCCc3ccccc3)CC2)[C@H](C1)c1ccccc1